{"text_format":"1","workbook":"xlsx","n_sheets":3,"sheets":["Synology Serial","Synology MAC","List"],"not_rendered":{"charts":0,"images":0,"macros":1,"external_links":0,"defined_names":6,"comments":1,"pivot_tables":0},"unopened":[],"bounds":{"document_bytes":16777216,"sheet_cells":100000,"rows_first":2000,"rows_last":500,"rows_between":2000,"halvings":0,"cell_chars":16384,"cell_head_chars":4096},"cells_cut":0,"cells_raw":0,"read":"whole","date_system":"1900"}

{"sheet":"Synology Serial","index":0,"n_rows":50,"n_cols":14,"rows_kept":50,"cut":false,"hidden":false,"merged":[[2,8,2,13]]}
[]
[null,"Model","Mask serial number"]
[1,"CS-406","A1C1NXXXXX",null,null,"Serial generator",null,null,"Serian number"]
[2,"CS-406e","A1C2NXXXXX",null,null,null,null,null,"Letter","Number","Permanent part","N","Null","Number"]
[3,"CS407","A1C3NXXXXX",null,null,"Select model",null,null,{"$f":"CHAR(RANDBETWEEN(65,67))","v":"A"},{"$f":"RANDBETWEEN(1,9)","v":4},{"$f":"VLOOKUP(F6,List_search,3,FALSE)","v":"OD"},"N",{"$f":"VLOOKUP(List!H1,Nulls,2,TRUE)","v":"0"},{"$f":"RANDBETWEEN(1,9999)","v":7392}]
[4,"CS407e","A1C4NXXXXX",null,null,"DS3617xs"]
[5,"DS-101","A1D1NXXXXX",null,null,"Serial number"]
[6,"DS-101g+","A1D2NXXXXX",null,null,"1330ODN615672"]
[7,"DS-101j","A1D3NXXXXX"]
[8,"DS107","A1E2NXXXXX"]
[9,"DS107+","A1E3NXXXXX"]
[10,"DS108j","A1E7NXXXXX"]
[11,"DS112","A1KDNXXXXX"]
[12,"DS112j","A1KENXXXXX"]
[13,"DS1511+","A13J4NXXXXX"]
[14,"DS1511+","A1J4NXXXXX"]
[15,"DS1512+","A1KANXXXXX"]
[16,"DS1812+","A1K6NXXXXX"]
[17,"DS207+","A1E1NXXXXX"]
[18,"DS211+","A1K5NXXXXX"]
[19,"DS211+","A1J3NXXXXX"]
[20,"DS212","A1K3NXXXXX"]
[21,"DS212+","A1KBNXXXXX"]
[22,"DS212j","A1K8NXXXXX"]
[23,"DS2411+","A1JDNXXXXX"]
[24,"DS3611xs","A1JFNXXXXX"]
[25,"DS3612xs","A1KINXXXXX"]
[26,"DS3615xs","A1LWNXXXXX"]
[27,"DS408","A1E9NXXXXX"]
[28,"DS411","A1J1NXXXXX"]
[29,"DS411+II","A1K2NXXXXX"]
[30,"DS412+","A1KFNXXXXX"]
[31,"DS413j","A1KVNXXXXX"]
[32,"DS508","A1E4NXXXXX"]
[33,"DS712+","A1K4NXXXXX"]
[34,"DX1211","A1JENXXXXX"]
[35,"RS212","A1K7NXXXXX"]
[36,"RS2211+","A1J7NXXXXX"]
[37,"RS2211RP+","A1J8NXXXXX"]
[38,"RS3411RPxs","A1JCNXXXXX"]
[39,"RS3411xs","A1JBNXXXXX"]
[40,"RS408","A1E5NXXXXX"]
[41,"RS408-RP","A1E6NXXXXX"]
[42,"RS411","A1J2NXXXXX"]
[43,"RS812","A1K9NXXXXX"]
[44,"RS812+","A1KGNXXXXX"]
[45,"RS812RP+","A1KHNXXXXX"]
[46,"RX1211","A1J9NXXXXX"]
[47,"DS916+","A1NLNXXXXX"]
[48,"DS3617xs","A1ODNXXXXX"]

{"sheet":"Synology MAC","index":1,"n_rows":5,"n_cols":5,"rows_kept":5,"cut":false,"hidden":false,"merged":[[1,1,1,4],[4,1,5,4]]}
[]
[null,"MAC-adress"]
[null,"permanent part (I-II-III)","IV","V","VI"]
[null,"00-11-32-",{"$f":"VLOOKUP(RANDBETWEEN(1,16),List!J1:K36,2,TRUE)&VLOOKUP(RANDBETWEEN(1,16),List!J1:K36,2,TRUE)","v":"01"},{"$f":"VLOOKUP(RANDBETWEEN(1,16),List!J1:K36,2,TRUE)&VLOOKUP(RANDBETWEEN(1,16),List!J1:K36,2,TRUE)","v":"71"},{"$f":"VLOOKUP(RANDBETWEEN(1,16),List!J1:K36,2,TRUE)&VLOOKUP(RANDBETWEEN(1,16),List!J1:K36,2,TRUE)","v":"6F"}]
[null,{"$f":"B4&C4&\"-\"&D4&\"-\"&E4","v":"00-11-32-01-71-6F"}]

{"sheet":"List","index":2,"n_rows":48,"n_cols":11,"rows_kept":48,"cut":false,"hidden":false,"merged":[]}
["CS-406","A1C1NXXXXX","C1","N",null,1,"0000",{"$f":"LEN('Synology Serial'!N5)","v":4},null,1,0]
["CS-406e","A1C2NXXXXX","C2","N",null,2,"000",null,null,2,1]
["CS407","A1C3NXXXXX","C3","N",null,3,"00",null,null,3,2]
["CS407e","A1C4NXXXXX","C4","N",null,4,"0",null,null,4,3]
["DS-101","A1D1NXXXXX","D1","N",null,null,null,null,null,5,4]
["DS-101g+","A1D2NXXXXX","D2","N",null,null,null,null,null,6,5]
["DS-101j","A1D3NXXXXX","D3","N",null,null,null,null,null,7,6]
["DS107","A1E2NXXXXX","E2","N",null,null,null,null,null,8,7]
["DS107+","A1E3NXXXXX","E3","N",null,null,null,null,null,9,8]
["DS108j","A1E7NXXXXX","E7","N",null,null,null,null,null,10,9]
["DS112","A1KDNXXXXX","KD","N",null,null,null,null,null,11,"A"]
["DS112j","A1KENXXXXX","KE","N",null,null,null,null,null,12,"B"]
["DS1511+","A13J4NXXXXX","3J4","N",null,null,null,null,null,13,"C"]
["DS1511+","A1J4NXXXXX","J4","N",null,null,null,null,null,14,"D"]
["DS1512+","A1KANXXXXX","KA","N",null,null,null,null,null,15,"E"]
["DS1812+","A1K6NXXXXX","K6","N",null,null,null,null,null,16,"F"]
["DS207+","A1E1NXXXXX","E1","N",null,null,null,null,null,17,"G"]
["DS211+","A1K5NXXXXX","K5","N",null,null,null,null,null,18,"H"]
["DS211+","A1J3NXXXXX","J3","N",null,null,null,null,null,19,"I"]
["DS212","A1K3NXXXXX","K3","N",null,null,null,null,null,20,"J"]
["DS212+","A1KBNXXXXX","KB","N",null,null,null,null,null,21,"K"]
["DS212j","A1K8NXXXXX","K8","N",null,null,null,null,null,22,"L"]
["DS2411+","A1JDNXXXXX","JD","N",null,null,null,null,null,23,"M"]
["DS3611xs","A1JFNXXXXX","JF","N",null,null,null,null,null,24,"N"]
["DS3612xs","A1KINXXXXX","KI","N",null,null,null,null,null,25,"O"]
["DS3615xs","A1LWNXXXXX","LW","N",null,null,null,null,null,26,"P"]
["DS408","A1E9NXXXXX","E9","N",null,null,null,null,null,27,"Q"]
["DS411","A1J1NXXXXX","J1","N",null,null,null,null,null,28,"R"]
["DS411+II","A1K2NXXXXX","K2","N",null,null,null,null,null,29,"S"]
["DS412+","A1KFNXXXXX","KF","N",null,null,null,null,null,30,"T"]
["DS413j","A1KVNXXXXX","KV","N",null,null,null,null,null,31,"U"]
["DS508","A1E4NXXXXX","E4","N",null,null,null,null,null,32,"V"]
["DS712+","A1K4NXXXXX","K4","N",null,null,null,null,null,33,"W"]
["DX1211","A1JENXXXXX","JE","N",null,null,null,null,null,34,"X"]
["RS212","A1K7NXXXXX","K7","N",null,null,null,null,null,35,"Y"]
["RS2211+","A1J7NXXXXX","J7","N",null,null,null,null,null,36,"Z"]
["RS2211RP+","A1J8NXXXXX","J8","N"]
["RS3411RPxs","A1JCNXXXXX","JC","N"]
["RS3411xs","A1JBNXXXXX","JB","N"]
["RS408","A1E5NXXXXX","E5","N"]
["RS408-RP","A1E6NXXXXX","E6","N"]
["RS411","A1J2NXXXXX","J2","N"]
["RS812","A1K9NXXXXX","K9","N"]
["RS812+","A1KGNXXXXX","KG","N"]
["RS812RP+","A1KHNXXXXX","KH","N"]
["RX1211","A1J9NXXXXX","J9","N"]
["DS916+","A1NLNXXXXX","NL","N"]
["DS3617xs","A1ODNXXXXX","OD","N"]